Target
Bile acid receptor
Ligand
BDBM21679
Substrate
BDBM10852
Meas. Tech.
FXR Activity Assay
pH
7.2±n/a
Temperature
310.15±n/a K
EC50
11800±n/a nM
Comments
The efficacy=73% of 10 uM 6ECDCA.
Citation
 Pellicciari, RSato, HGioiello, ACostantino, GMacchiarulo, ASadeghpour, BMGiorgi, GSchoonjans, KAuwerx, J Nongenomic actions of bile acids. Synthesis and preliminary characterization of 23- and 6,23-alkyl-substituted bile acid derivatives as selective modulators for the G-protein coupled receptor TGR5. J Med Chem 50:4265-8 (2007)  
Target
Name:
Bile acid receptor
Synonyms:
BAR FXR HRR1 NR1H4_HUMAN RIP14 Retinoid X receptor-interacting protein 14 | farnesoid x receptor
Type:
Nuclear Receptor
Mol. Mass.:
55916.24
Organism:
Homo sapiens (Human)
Description:
Q96RI1
Residue:
486
  
Inhibitor
Name:
BDBM21679
Synonyms:
(2S,4R)-4-[(1S,2S,5R,7S,8R,9R,10S,11S,14R,15R)-8-ethyl-5,9-dihydroxy-2,15-dimethyltetracyclo[8.7.0.0^{2,7}.0^{11,15}]heptadecan-14-yl]-2-methylpentanoic acid | 23(S)-methyl-BA derivative, 7c
Type:
Steroid
Emp. Form.:
C27H46O4
Mol. Mass.:
434.6517
SMILES:
[H][C@@]1(CC[C@@]2([H])[C@]3([H])[C@H](O)[C@H](CC)[C@]4([H])C[C@H](O)CC[C@]4(C)[C@@]3([H])CC[C@]12C)[C@H](C)C[C@H](C)C(O)=O
:
Substrate