Target
Peptide deformylase
Ligand
BDBM21683
Substrate
PDF substrate peptide
Meas. Tech.
PDF Inhibition Assay
pH
7.6±n/a
Temperature
298.15±n/a K
IC50
400±40 nM
Km
4000000±n/a nM
kcat
332±n/a 1/sec
Citation
 Smith, KJPetit, CMAubart, KSmyth, MMcManus, EJones, JFosberry, ALewis, CLonetto, MChristensen, SB Structural variation and inhibitor binding in polypeptide deformylase from four different bacterial species. Protein Sci 12:349-60 (2003)  
Target
Name:
Peptide deformylase
Synonyms:
DEF_STRR6 Polypeptide Deformylase def
Type:
Enzyme
Mol. Mass.:
22684.24
Organism:
Streptococcus pneumoniae (strain ATCC BAA-255 / R6)
Description:
The pdf gene from S. pneumoniae was cloned and protein was expressed and purified from E. coli BL21(DE3).
Residue:
203
  
Inhibitor
Name:
BDBM21683
Synonyms:
N-hydroxy-N-(3-phenylpropyl)formamide | SB-485345
Type:
Small organic molecule
Emp. Form.:
C10H13NO2
Mol. Mass.:
179.2157
SMILES:
ON(CCCc1ccccc1)C=O
:
Substrate
Name:
PDF substrate peptide
Synonyms:
Type:
Peptide
Mol. Mass.:
1718.01
Organism:
Description:
Residue:
14
FRMYLMETALASER