Target
Peroxisome proliferator-activated receptor alpha
Ligand
BDBM21756
Substrate
CBP
Meas. Tech.
PPAR FRET Assay
pH
7.4±n/a
Temperature
295.15±n/a K
EC50
6800±n/a nM
Citation
 Rudolph, JChen, LMajumdar, DBullock, WHBurns, MClaus, TDela Cruz, FEDaly, MEhrgott, FJJohnson, JSLivingston, JNSchoenleber, RWShapiro, JYang, LTsutsumi, MMa, X Indanylacetic acid derivatives carrying 4-thiazolyl-phenoxy tail groups, a new class of potent PPAR alpha/gamma/delta pan agonists: synthesis, structure-activity relationship, and in vivo efficacy. J Med Chem 50:984-1000 (2007)  
Target
Name:
Peroxisome proliferator-activated receptor alpha
Synonyms:
NR1C1 PPAR PPAR-alpha PPARA_HUMAN Peroxisome proliferator-activated receptor | Peroxisome proliferator-activated receptor alpha (PPAR alpha)
Type:
Enzyme
Mol. Mass.:
52222.08
Organism:
Homo sapiens (Human)
Description:
Q07869
Residue:
468
  
Inhibitor
Name:
BDBM21756
Synonyms:
2-[(1S)-5-{3-[4-(trifluoromethoxy)phenoxy]propoxy}-2,3-dihydro-1H-inden-1-yl]acetic acid | Indanylacetic Acid Analog, 17d
Type:
Small organic molecule
Emp. Form.:
C21H21F3O5
Mol. Mass.:
410.3836
SMILES:
OC(=O)C[C@@H]1CCc2cc(OCCCOc3ccc(OC(F)(F)F)cc3)ccc12
:
Substrate
Name:
CREB-binding protein
Synonyms:
CBP CREB-binding protein (CBP) CREBBP
Type:
Transcription Coactivator
Mol. Mass.:
265411.66
Organism:
Homo sapiens (Human)
Description:
Q92793
Residue:
2442