Target
Peroxisome proliferator-activated receptor alpha
Ligand
BDBM21791
Substrate
CBP
Meas. Tech.
PPAR FRET Assay
Temperature
298.15±n/a K
EC50
254±n/a nM
Comments
extracted
Citation
 Rudolph, JChen, LMajumdar, DBullock, WHBurns, MClaus, TDela Cruz, FEDaly, MEhrgott, FJJohnson, JSLivingston, JNSchoenleber, RWShapiro, JYang, LTsutsumi, MMa, X Indanylacetic acid derivatives carrying 4-thiazolyl-phenoxy tail groups, a new class of potent PPAR alpha/gamma/delta pan agonists: synthesis, structure-activity relationship, and in vivo efficacy. J Med Chem 50:984-1000 (2007)  
Target
Name:
Peroxisome proliferator-activated receptor alpha
Synonyms:
NR1C1 PPAR PPAR-alpha PPARA_HUMAN Peroxisome proliferator-activated receptor | Peroxisome proliferator-activated receptor alpha (PPAR alpha)
Type:
Enzyme
Mol. Mass.:
52222.08
Organism:
Homo sapiens (Human)
Description:
Q07869
Residue:
468
  
Inhibitor
Name:
BDBM21791
Synonyms:
2-[(1S)-5-{3-[4-(4-ethyl-1,3-thiazol-2-yl)-2-methoxyphenoxy]propoxy}-2,3-dihydro-1H-inden-1-yl]acetic acid | Indanylacetic Acid Analog, 34f
Type:
Small organic molecule
Emp. Form.:
C26H29NO5S
Mol. Mass.:
467.577
SMILES:
CCc1csc(n1)-c1ccc(OCCCOc2ccc3[C@H](CC(O)=O)CCc3c2)c(OC)c1
:
Substrate
Name:
CREB-binding protein
Synonyms:
CBP CREB-binding protein (CBP) CREBBP
Type:
Transcription Coactivator
Mol. Mass.:
265411.66
Organism:
Homo sapiens (Human)
Description:
Q92793
Residue:
2442