Target
Peroxisome proliferator-activated receptor delta
Ligand
BDBM21818
Substrate
TRAP220
Meas. Tech.
PPAR FRET Assay
Temperature
298.15±n/a K
EC50
1.2±n/a nM
Comments
extracted
Citation
 Rudolph, JChen, LMajumdar, DBullock, WHBurns, MClaus, TDela Cruz, FEDaly, MEhrgott, FJJohnson, JSLivingston, JNSchoenleber, RWShapiro, JYang, LTsutsumi, MMa, X Indanylacetic acid derivatives carrying 4-thiazolyl-phenoxy tail groups, a new class of potent PPAR alpha/gamma/delta pan agonists: synthesis, structure-activity relationship, and in vivo efficacy. J Med Chem 50:984-1000 (2007)  
Target
Name:
Peroxisome proliferator-activated receptor delta
Synonyms:
NR1C2 NUCI Nuclear receptor subfamily 1 group C member 2 PPAR-beta PPARD Peroxisome proliferator-activated receptor Peroxisome proliferator-activated receptor delta
Type:
Enzyme
Mol. Mass.:
49910.45
Organism:
Homo sapiens (Human)
Description:
Q03181
Residue:
441
  
Inhibitor
Name:
BDBM21818
Synonyms:
2-[(1S)-5-{3-[4-(4-ethoxy-1,3-thiazol-2-yl)phenoxy]propoxy}-2,3-dihydro-1H-inden-1-yl]acetic acid | Indanylacetic Acid Analog, 34ag
Type:
Small organic molecule
Emp. Form.:
C25H27NO5S
Mol. Mass.:
453.551
SMILES:
CCOc1csc(n1)-c1ccc(OCCCOc2ccc3[C@H](CC(O)=O)CCc3c2)cc1
:
Substrate
Name:
TRAP220
Synonyms:
ARC205 CRSP200 DRIP230 MED1_HUMAN PBP PPARGBP RB18A TRIP2 | Thyroid hormone receptor-associated protein complex 220 kDa component
Type:
Transcription Coactivator
Mol. Mass.:
168519.50
Organism:
Homo sapiens (Human)
Description:
Residue:
1581