Target
Proto-oncogene tyrosine-protein kinase receptor Ret
Ligand
BDBM370340
Substrate
Meas. Tech.
Measurement of RET Inhibitory Activity
IC50
1.94±n/a nM
Citation
 Miyazaki, IShimamura, TKato, MFujita, H Fused pyrimidine compound or salt thereof US Patent  US10233189 Publication Date 3/19/2019 
Target
Name:
Proto-oncogene tyrosine-protein kinase receptor Ret
Synonyms:
CDHF12 Cadherin family member 12 Proto-oncogene c-Ret RET51 Tyrosine-protein kinase Ret (RET)
Type:
Protein
Mol. Mass.:
124318.29
Organism:
Homo sapiens (Human)
Description:
P07949
Residue:
1114
  
Inhibitor
Name:
BDBM370340
Synonyms:
US10233189, Example 1 US11014930, Example 1 | US11236096, Example 1
Type:
Small organic molecule
Emp. Form.:
C16H20N8O
Mol. Mass.:
340.383
SMILES:
CCc1cc(NC(=O)c2nn(C3CCCC3)c3ncnc(N)c23)n[nH]1
: