Target
Proto-oncogene tyrosine-protein kinase receptor Ret
Ligand
BDBM370372
Substrate
Meas. Tech.
Measurement of RET Inhibitory Activity
IC50
0.140±n/a nM
Citation
 Miyazaki, IShimamura, TKato, MFujita, H Fused pyrimidine compound or salt thereof US Patent  US10233189 Publication Date 3/19/2019 
Target
Name:
Proto-oncogene tyrosine-protein kinase receptor Ret
Synonyms:
CDHF12 Cadherin family member 12 Proto-oncogene c-Ret RET51 Tyrosine-protein kinase Ret (RET)
Type:
Protein
Mol. Mass.:
124318.29
Organism:
Homo sapiens (Human)
Description:
P07949
Residue:
1114
  
Inhibitor
Name:
BDBM370372
Synonyms:
US10233189, Example 76 US11236096, Example 76
Type:
Small organic molecule
Emp. Form.:
C15H16BrN7O
Mol. Mass.:
390.238
SMILES:
Cc1cc(NC(=O)c2c(Br)n(c3ncnc(N)c23)C2(C)CC2)[nH]n1
: