Target
Indoleamine 2,3-dioxygenase 1
Ligand
BDBM50138829
Substrate
Meas. Tech.
Enzymatic IDO Assay
IC50
550±n/a nM
Citation
 Mautino, MKumar, SWaldo, JJaipuri, FKesharwani, TZhang, X IDO inhibitors US Patent  US10233190 Publication Date 3/19/2019 
Target
Name:
Indoleamine 2,3-dioxygenase 1
Synonyms:
I23O1_HUMAN IDO-1 INDO Indoleamine 2,3-dioxygenase | Indoleamine-pyrrole 2,3-dioxygenase
Type:
Enzyme
Mol. Mass.:
45330.80
Organism:
Homo sapiens (Human)
Description:
P14902
Residue:
403
  
Inhibitor
Name:
BDBM50138829
Synonyms:
CHEMBL3754097 | US10233190, Example 1416
Type:
Small organic molecule
Emp. Form.:
C18H22N2O
Mol. Mass.:
282.3801
SMILES:
O[C@@H](C[C@@H]1c2ccccc2-c2cncn12)C1CCCCC1
: