Target
Indoleamine 2,3-dioxygenase 1
Ligand
BDBM370512
Substrate
Meas. Tech.
Enzymatic IDO Assay
IC50
5500±n/a nM
Citation
 Mautino, MKumar, SWaldo, JJaipuri, FKesharwani, TZhang, X IDO inhibitors US Patent  US10233190 Publication Date 3/19/2019 
Target
Name:
Indoleamine 2,3-dioxygenase 1
Synonyms:
I23O1_HUMAN IDO-1 INDO Indoleamine 2,3-dioxygenase | Indoleamine-pyrrole 2,3-dioxygenase
Type:
Enzyme
Mol. Mass.:
45330.80
Organism:
Homo sapiens (Human)
Description:
P14902
Residue:
403
  
Inhibitor
Name:
BDBM370512
Synonyms:
1-cyclohexyl-2-(5H-imidazo[5,1-a]isoindol-5- yl)ethyl benzoate | US10233190, Example 1431
Type:
Small organic molecule
Emp. Form.:
C25H26N2O2
Mol. Mass.:
386.4861
SMILES:
O=C(OC(CC1c2ccccc2-c2cncn12)C1CCCCC1)c1ccccc1
: