Target
Indoleamine 2,3-dioxygenase 1
Ligand
BDBM370514
Substrate
Meas. Tech.
Enzymatic IDO Assay
IC50
5500±n/a nM
Citation
 Mautino, MKumar, SWaldo, JJaipuri, FKesharwani, TZhang, X IDO inhibitors US Patent  US10233190 Publication Date 3/19/2019 
Target
Name:
Indoleamine 2,3-dioxygenase 1
Synonyms:
I23O1_HUMAN IDO-1 INDO Indoleamine 2,3-dioxygenase | Indoleamine-pyrrole 2,3-dioxygenase
Type:
Enzyme
Mol. Mass.:
45330.80
Organism:
Homo sapiens (Human)
Description:
P14902
Residue:
403
  
Inhibitor
Name:
BDBM370514
Synonyms:
(2S)-1-(1-cyclohexyl-2-(5H-imidazo[5,1- a]isoindol-5-yl)ethoxy)-3-methyl-1-oxobutan-2- aminium chloride | US10233190, Example 1433
Type:
Small organic molecule
Emp. Form.:
C23H32N3O2
Mol. Mass.:
382.5185
SMILES:
CC(C)C([NH3+])C(=O)OC(CC1c2ccccc2-c2cncn12)C1CCCCC1
: