Target
Indoleamine 2,3-dioxygenase 1
Ligand
BDBM370518
Substrate
Meas. Tech.
Enzymatic IDO Assay
IC50
5500±n/a nM
Citation
 Mautino, MKumar, SWaldo, JJaipuri, FKesharwani, TZhang, X IDO inhibitors US Patent  US10233190 Publication Date 3/19/2019 
Target
Name:
Indoleamine 2,3-dioxygenase 1
Synonyms:
I23O1_HUMAN IDO-1 INDO Indoleamine 2,3-dioxygenase | Indoleamine-pyrrole 2,3-dioxygenase
Type:
Enzyme
Mol. Mass.:
45330.80
Organism:
Homo sapiens (Human)
Description:
P14902
Residue:
403
  
Inhibitor
Name:
BDBM370518
Synonyms:
2-(5H-imidazo[5,1-a]isoindol-5-yl)-1- (spiro[2.5]octan-6-yl)ethanol | US10233190, Example 1438
Type:
Small organic molecule
Emp. Form.:
C20H24N2O
Mol. Mass.:
308.4174
SMILES:
OC(CC1c2ccccc2-c2cncn12)C1CCC2(CC2)CC1
: