Target
Indoleamine 2,3-dioxygenase 1
Ligand
BDBM370537
Substrate
Meas. Tech.
Enzymatic IDO Assay
IC50
550±n/a nM
Citation
 Mautino, MKumar, SWaldo, JJaipuri, FKesharwani, TZhang, X IDO inhibitors US Patent  US10233190 Publication Date 3/19/2019 
Target
Name:
Indoleamine 2,3-dioxygenase 1
Synonyms:
I23O1_HUMAN IDO-1 INDO Indoleamine 2,3-dioxygenase | Indoleamine-pyrrole 2,3-dioxygenase
Type:
Enzyme
Mol. Mass.:
45330.80
Organism:
Homo sapiens (Human)
Description:
P14902
Residue:
403
  
Inhibitor
Name:
BDBM370537
Synonyms:
US10233190, Example 1470 | tert-butyl 4-((R)-1-hydroxy-2-((R)-5H- imidazo[5,1-a]isoindol-5-yl)ethyl)piperidine-1- carboxylate
Type:
Small organic molecule
Emp. Form.:
C22H29N3O3
Mol. Mass.:
383.484
SMILES:
CC(C)(C)OC(=O)N1CCC(CC1)[C@H](O)C[C@@H]1c2ccccc2-c2cncn12
: