Target
Indoleamine 2,3-dioxygenase 1
Ligand
BDBM370564
Substrate
Meas. Tech.
Enzymatic IDO Assay
IC50
<1000±n/a nM
Citation
 Mautino, MKumar, SWaldo, JJaipuri, FKesharwani, TZhang, X IDO inhibitors US Patent  US10233190 Publication Date 3/19/2019 
Target
Name:
Indoleamine 2,3-dioxygenase 1
Synonyms:
I23O1_HUMAN IDO-1 INDO Indoleamine 2,3-dioxygenase | Indoleamine-pyrrole 2,3-dioxygenase
Type:
Enzyme
Mol. Mass.:
45330.80
Organism:
Homo sapiens (Human)
Description:
P14902
Residue:
403
  
Inhibitor
Name:
BDBM370564
Synonyms:
4-((S)-1-hydroxy-2-((S)-5H-imidazo[5,1- a]isoindol-5-yl)ethyl)-N-((1r,4S)-4- hydroxycyclohexyl)piperidine-1-carboxamide | US10233190, Example 1497
Type:
Small organic molecule
Emp. Form.:
C24H32N4O3
Mol. Mass.:
424.5359
SMILES:
O[C@@H](C[C@H]1c2ccccc2-c2cncn12)C1CCN(CC1)C(=O)N[C@H]1CC[C@H](O)CC1
: