Target
Sphingosine 1-phosphate receptor 1
Ligand
BDBM255786
Substrate
Meas. Tech.
S1P Assay
EC50
1820±n/a nM
Citation
 Gill, GSGrobelny, DW S1P receptors modulators and their use thereof US Patent  US9707205 Publication Date 7/18/2017 
Target
Name:
Sphingosine 1-phosphate receptor 1
Synonyms:
CHEDG1 Endothelial differentiation G-protein coupled receptor 1 S1P1 S1PR1_HUMAN Sphingosine 1-phosphate receptor Edg-1
Type:
Enzyme
Mol. Mass.:
42836.02
Organism:
Homo sapiens (Human)
Description:
P21453
Residue:
382
  
Inhibitor
Name:
BDBM255786
Synonyms:
(E)-2-Amino-2-(5-(5-(4-methylstyryl)-1,2,4-oxadiazol-3-yl)benzofuran-2-yl)propane-1,3-diol | US9707205, 37
Type:
Small organic molecule
Emp. Form.:
C22H21N3O4
Mol. Mass.:
391.4198
SMILES:
Cc1ccc(\C=C\c2nc(no2)-c2ccc3oc(cc3c2)C(N)(CO)CO)cc1
: