Target
Dipeptidyl peptidase 1
Ligand
BDBM150488
Substrate
Meas. Tech.
Inhibition of Human DPPI (Cathepsin C)
IC50
2.00±n/a nM
Citation
 Anderskewitz, RBinder, FGrauert, MGrundl, MHaebel, PWOost, TPautsch, APeters, SVintonyak, V Methods for treating pulmonary emphysema using substituted 2-Aza-bicyclo[2.2.1]heptane-3-carboxylic acid (benzyl-cyano-methyl)-amides inhibitors of Cathepsin C US Patent  US10238633 Publication Date 3/26/2019 
Target
Name:
Dipeptidyl peptidase 1
Synonyms:
CATC_HUMAN CTSC Cathepsin J Dipeptidyl peptidase 1 (DPPI) Dipeptidyl peptidase I (DPPI)
Type:
Enzyme
Mol. Mass.:
51857.28
Organism:
Homo sapiens (Human)
Description:
P53634
Residue:
463
  
Inhibitor
Name:
BDBM150488
Synonyms:
US10238633, Example 162 US9713606, 162
Type:
Small organic molecule
Emp. Form.:
C21H19FN4O2
Mol. Mass.:
378.3996
SMILES:
Fc1cc(ccc1C[C@H](NC(=O)[C@H]1N[C@@H]2CC[C@H]1C2)C#N)-c1ccc(o1)C#N
: