Target
Dipeptidyl peptidase 1
Ligand
BDBM150672
Substrate
Meas. Tech.
Inhibition of Human DPPI (Cathepsin C)
IC50
1.000±n/a nM
Citation
 Anderskewitz, RBinder, FGrauert, MGrundl, MHaebel, PWOost, TPautsch, APeters, SVintonyak, V Methods for treating pulmonary emphysema using substituted 2-Aza-bicyclo[2.2.1]heptane-3-carboxylic acid (benzyl-cyano-methyl)-amides inhibitors of Cathepsin C US Patent  US10238633 Publication Date 3/26/2019 
Target
Name:
Dipeptidyl peptidase 1
Synonyms:
CATC_HUMAN CTSC Cathepsin J Dipeptidyl peptidase 1 (DPPI) Dipeptidyl peptidase I (DPPI)
Type:
Enzyme
Mol. Mass.:
51857.28
Organism:
Homo sapiens (Human)
Description:
P53634
Residue:
463
  
Inhibitor
Name:
BDBM150672
Synonyms:
US10238633, Example 346 US9713606, 346
Type:
Small organic molecule
Emp. Form.:
C30H34FN5O2
Mol. Mass.:
515.6217
SMILES:
CN1CCC(CC1)N1C(=O)Cc2ccc(cc12)-c1ccc(C[C@H](NC(=O)[C@H]2N[C@@H]3CC[C@H]2C3)C#N)c(F)c1
: