Target
Focal adhesion kinase 1 [410-689]
Ligand
BDBM418817
Substrate
Meas. Tech.
In Vitro Activity Assay
IC50
<0.595±n/a nM
Citation
 Luzzio, MJFreeman-Cook, KDBhattacharya, SKHayward, MMHulford, CAAutry, CLZhao, XXiao, JNelson, KL Sulfonyl amide derivatives for the treatment of abnormal cell growth US Patent  US10450297 Publication Date 10/22/2019 
Target
Name:
Focal adhesion kinase 1 [410-689]
Synonyms:
FAK FAK1_HUMAN PTK2
Type:
Enzyme Catalytic Domain
Mol. Mass.:
32163.33
Organism:
Homo sapiens (Human)
Description:
aa 410-689
Residue:
280
  
Inhibitor
Name:
BDBM418817
Synonyms:
N-methyl-4-({4-[({3- [methyl(methylsulfonyl)amino]pyrazin-2- yl}methyl)amino]-5- (trifluoromethyl)pyrimidin-2- yl}amino)benzamide (317) US10450297, Example 318
Type:
Small organic molecule
Emp. Form.:
C20H21F3N8O3S
Mol. Mass.:
510.493
SMILES:
CNC(=O)c1ccc(Nc2ncc(c(NCc3nccnc3N(C)S(C)(=O)=O)n2)C(F)(F)F)cc1
: