Target
Focal adhesion kinase 1 [410-689]
Ligand
BDBM418834
Substrate
Meas. Tech.
In Vitro Activity Assay
IC50
<0.595±n/a nM
Citation
 Luzzio, MJFreeman-Cook, KDBhattacharya, SKHayward, MMHulford, CAAutry, CLZhao, XXiao, JNelson, KL Sulfonyl amide derivatives for the treatment of abnormal cell growth US Patent  US10450297 Publication Date 10/22/2019 
Target
Name:
Focal adhesion kinase 1 [410-689]
Synonyms:
FAK FAK1_HUMAN PTK2
Type:
Enzyme Catalytic Domain
Mol. Mass.:
32163.33
Organism:
Homo sapiens (Human)
Description:
aa 410-689
Residue:
280
  
Inhibitor
Name:
BDBM418834
Synonyms:
2-methyl-4-({4-[({2- [methyl(methylsulfonyl)amino]pyridin-3- yl}methyl)amino]-5- (trifluoromethyl)pyrimidin-2- yl)amino)benzamide (334) US10450297, Example 335
Type:
Small organic molecule
Emp. Form.:
C21H22F3N7O3S
Mol. Mass.:
509.505
SMILES:
CN(c1ncccc1CNc1nc(Nc2ccc(C(N)=O)c(C)c2)ncc1C(F)(F)F)S(C)(=O)=O
: