Target
Beta-secretase 2
Ligand
BDBM370650
Substrate
Meas. Tech.
BACE-2 Assay
Ki
10.00±n/a nM
Citation
 He, SCumming, JNScott, JD C5-C6-fused tricyclic iminothiadiazine dioxide compounds as BACE inhibitors, compositions, and their use US Patent  US10238743 Publication Date 3/26/2019 
Target
Name:
Beta-secretase 2
Synonyms:
AEPLC ASP1 Asp 1 Aspartyl protease 1 BACE2_HUMAN Beta-secretase (BACE) Beta-secretase 2 (BACE-2) Beta-site APP-cleaving enzyme 2 Memapsin-1 beta-Secretase (BACE-2)
Type:
Protein
Mol. Mass.:
56171.20
Organism:
Homo sapiens (Human)
Description:
Q9Y5Z0
Residue:
518
  
Inhibitor
Name:
BDBM370650
Synonyms:
US10238743, Example 26
Type:
Small organic molecule
Emp. Form.:
C20H21F2N5O3S
Mol. Mass.:
449.474
SMILES:
CN1C(=N)N[C@@]2(C)[C@H](CCCc3ccc(NC(=O)c4ncc(F)cc4F)cc23)S1(=O)=O
: