Target
Beta-secretase 2
Ligand
BDBM370670
Substrate
Meas. Tech.
BACE-2 Assay
Ki
2439±n/a nM
Citation
 He, SCumming, JNScott, JD C5-C6-fused tricyclic iminothiadiazine dioxide compounds as BACE inhibitors, compositions, and their use US Patent  US10238743 Publication Date 3/26/2019 
Target
Name:
Beta-secretase 2
Synonyms:
AEPLC ASP1 Asp 1 Aspartyl protease 1 BACE2_HUMAN Beta-secretase (BACE) Beta-secretase 2 (BACE-2) Beta-site APP-cleaving enzyme 2 Memapsin-1 beta-Secretase (BACE-2)
Type:
Protein
Mol. Mass.:
56171.20
Organism:
Homo sapiens (Human)
Description:
Q9Y5Z0
Residue:
518
  
Inhibitor
Name:
BDBM370670
Synonyms:
US10238743, Example 45
Type:
Small organic molecule
Emp. Form.:
C22H25N7O3S
Mol. Mass.:
467.544
SMILES:
COc1cnc2c(Nc3ccc4CCC[C@H]5[C@](C)(NC(=N)N(C)S5(=O)=O)c4c3)ccnc2n1
: