Target
Glutamate receptor ionotropic, NMDA 1/2B
Ligand
BDBM370710
Substrate
Meas. Tech.
NR2B NAM Assay
IC50
65.8±n/a nM
Citation
 Anderson, DRVolkmann, RAMenniti, FS N-alkylaryl-5-oxyaryl-octahydro-cyclopenta[c]pyrrole negative allosteric modulators of NR2B US Patent  US10239835 Publication Date 3/26/2019 
Target
Name:
Glutamate receptor ionotropic, NMDA 1/2B
Synonyms:
GluN1/GluN2B NMDA receptor Glutamate [NMDA] receptor subunit epsilon 2/zeta 1 nr2b nam
Type:
Enzyme
Mol. Mass.:
Description:
Components:
This complex has 2 components.
Component 1
Name:
Glutamate receptor ionotropic, NMDA 1
Synonyms:
GRIN1 Glutamate [NMDA] receptor subunit zeta-1 N-methyl-D-aspartate receptor subunit NR1 NMDZ1_HUMAN | phencyclidine
Type:
Enzyme Catalytic Domain
Mol. Mass.:
105397.81
Organism:
Homo sapiens (Human)
Description:
Q05586
Residue:
938
  
Component 2
Name:
Glutamate receptor ionotropic, NMDA 2B
Synonyms:
GRIN2B Glutamate [NMDA] receptor subunit epsilon 2 N-methyl D-aspartate receptor subtype 2B NMDAR2B NR3 | hNR3
Type:
PROTEIN
Mol. Mass.:
166375.46
Organism:
Homo sapiens (Human)
Description:
ChEMBL_1438829
Residue:
1484
  
Inhibitor
Name:
BDBM370710
Synonyms:
US10239835, Example 00262
Type:
Small organic molecule
Emp. Form.:
C21H26N2O4
Mol. Mass.:
370.4421
SMILES:
[H][C@@]12C[C@H](C[C@]1([H])CN(CC(O)c1ccc(O)cn1)C2)Oc1ccc(OC)cc1
: