Target
Delta-type opioid receptor
Ligand
BDBM21861
Substrate
BDBM21864
Meas. Tech.
Radioligand Binding Assay
Ki
>10000±n/a nM
Citation
 Mustazza, CBorioni, ASestili, ISbraccia, MRodomonte, ADel Giudice, MR Synthesis and pharmacological evaluation of 1,2-dihydrospiro[isoquinoline-4(3H),4'-piperidin]-3-ones as nociceptin receptor agonists. J Med Chem 51:1058-62 (2008)  
Target
Name:
Delta-type opioid receptor
Synonyms:
D-OR-1 Delta opioid receptor OPIATE Delta OPRD1 OPRK1 | opioid receptor, delta 1
Type:
G Protein-Coupled Receptor (GPCR)
Mol. Mass.:
40382.98
Organism:
Homo sapiens (Human)
Description:
Competition binding assays were carried out using membrane preparations from transfected HN9.10 cells that constitutively expressed the delta opioid receptor.
Residue:
372
  
Inhibitor
Name:
BDBM21861
Synonyms:
N-methyl-4-phenyl-1-[4-(propan-2-yl)cyclohexyl]piperidine-4-carboxamide | Piperidine Derivative, 4j
Type:
Small organic molecule
Emp. Form.:
C22H34N2O
Mol. Mass.:
342.5182
SMILES:
CNC(=O)C1(CCN(CC1)C1CCC(CC1)C(C)C)c1ccccc1
:
Substrate
Name:
BDBM21864
Synonyms:
(21R)-22-(cyclopropylmethyl)-14-oxa-11,22-diazaheptacyclo[13.9.1.0^{1,13}.0^{2,21}.0^{4,12}.0^{5,10}.0^{19,25}]pentacosa-4(12),5,7,9,15,17,19(25)-heptaene-2,16-diol NALTRINDOLE | [3H]-naltrindole
Type:
radiolabeled ligand
Emp. Form.:
C26H26N2O3
Mol. Mass.:
414.4962
SMILES:
[H][C@@]12Cc3ccc(O)c4OC5c6[nH]c7ccccc7c6CC1(O)C5(CCN2CC1CC1)c34
: