Target
Orexin receptor type 2
Ligand
BDBM370827
Substrate
Meas. Tech.
FLIPR Ca2+ Flux Assay
IC50
66.0±n/a nM
Citation
 Kuduk, SDLiverton, NLuo, Y Heteroaryl orexin receptor antagonists US Patent  US10239838 Publication Date 3/26/2019 
Target
Name:
Orexin receptor type 2
Synonyms:
HCRTR2 OX2R_HUMAN Orexin receptor type 2 (OR-2) Orexin receptor type 2 (OX2R) Ox-2-R | Ox2-R
Type:
Protein
Mol. Mass.:
50710.53
Organism:
Homo sapiens (Human)
Description:
O43614
Residue:
444
  
Inhibitor
Name:
BDBM370827
Synonyms:
N-ethyl-N-{2-[6-(1-hydroxy-1- methylethyl)pyridin-2-yl]ethyl}-2- (1H-pyrazol-1-yl)benzamide | US10239838, Example 12
Type:
Small organic molecule
Emp. Form.:
C22H26N4O2
Mol. Mass.:
378.4674
SMILES:
CCN(CCc1cccc(n1)C(C)(C)O)C(=O)c1ccccc1-n1cccn1
: