Target
Orexin receptor type 2
Ligand
BDBM370858
Substrate
Meas. Tech.
FLIPR Ca2+ Flux Assay
IC50
336±n/a nM
Citation
 Kuduk, SDLiverton, NLuo, Y Heteroaryl orexin receptor antagonists US Patent  US10239838 Publication Date 3/26/2019 
Target
Name:
Orexin receptor type 2
Synonyms:
HCRTR2 OX2R_HUMAN Orexin receptor type 2 (OR-2) Orexin receptor type 2 (OX2R) Ox-2-R | Ox2-R
Type:
Protein
Mol. Mass.:
50710.53
Organism:
Homo sapiens (Human)
Description:
O43614
Residue:
444
  
Inhibitor
Name:
BDBM370858
Synonyms:
N-ethyl-N-{2-[5-(1-hydroxy-1- methylethyl)pyridin-2-yl]ethyl}-2- propylbenzamide | US10239838, Example 52
Type:
Small organic molecule
Emp. Form.:
C22H30N2O2
Mol. Mass.:
354.4858
SMILES:
CCCc1ccccc1C(=O)N(CC)CCc1ccc(cn1)C(C)(C)O
: