Target
Orexin receptor type 2
Ligand
BDBM370861
Substrate
Meas. Tech.
FLIPR Ca2+ Flux Assay
IC50
388±n/a nM
Citation
 Kuduk, SDLiverton, NLuo, Y Heteroaryl orexin receptor antagonists US Patent  US10239838 Publication Date 3/26/2019 
Target
Name:
Orexin receptor type 2
Synonyms:
HCRTR2 OX2R_HUMAN Orexin receptor type 2 (OR-2) Orexin receptor type 2 (OX2R) Ox-2-R | Ox2-R
Type:
Protein
Mol. Mass.:
50710.53
Organism:
Homo sapiens (Human)
Description:
O43614
Residue:
444
  
Inhibitor
Name:
BDBM370861
Synonyms:
N-ethyl-N-{2-[5-(1-hydroxy-1- methylethyl)pyridin-2-yl]ethyl}-2- (2H-tetrazol-2-yl)benzamide | US10239838, Example 55
Type:
Small organic molecule
Emp. Form.:
C20H24N6O2
Mol. Mass.:
380.4436
SMILES:
CCN(CCc1ccc(cn1)C(C)(C)O)C(=O)c1ccccc1-n1ncnn1
: