Target
Protein Tax-1
Ligand
BDBM370890
Substrate
Meas. Tech.
MT4 Assay
IC50
92.0±n/a nM
Citation
 Johns, BASuwandi, LSVelthuisen, EJWeatherhead, JG Benzoazepine derivatives US Patent  US10239840 Publication Date 3/26/2019 
Target
Name:
Protein Tax-1
Synonyms:
Protein PX Tax X-LOR
Type:
Enzyme Catalytic Domain
Mol. Mass.:
39474.08
Organism:
Human T-cell leukemia virus 1 (strain Japan ATK-1 subtype A) (HTLV-1)
Description:
Residue:
353
  
Inhibitor
Name:
BDBM370890
Synonyms:
US10239840, Example 19
Type:
Small organic molecule
Emp. Form.:
C34H40FNO4
Mol. Mass.:
545.6841
SMILES:
Cc1c2CCCOc2c(F)cc1-c1c(C)c2CCN(CCc2c(C)c1[C@H](OC(C)(C)C)C(O)=O)c1ccccc1
: