Target
Phosphatidylinositol 4,5-bisphosphate 3-kinase catalytic subunit beta/delta isoform
Ligand
BDBM255823
Substrate
Meas. Tech.
A2 PI3Kdelta Scintillation Proximity Assay
pH
6.7±n/a
Temperature
298.15±n/a K
IC50
<10±n/a nM
Comments
extracted
Citation
 Li, YCombs, APYue, EWDouty, BMei, S Heterocyclylamines as PI3K inhibitors US Patent  US9707233 Publication Date 7/18/2017 
Target
Name:
Phosphatidylinositol 4,5-bisphosphate 3-kinase catalytic subunit beta/delta isoform
Synonyms:
p110δ/p85α p110-delta/ p110-gamma | pi3k$#948
Type:
Protein
Mol. Mass.:
Description:
Components:
This complex has 2 components.
Component 1
Name:
Phosphatidylinositol 4,5-bisphosphate 3-kinase catalytic subunit delta isoform
Synonyms:
PI3-kinase p110 subunit delta PI3-kinase subunit p110-delta PIK3CD Phosphatidylinositol 4,5-biphosphate 3-kinase catalytic subunit delta (PIK3CD) Phosphatidylinositol 4,5-bisphosphate 3-kinase 110 kDa catalytic subunit delta (PI3K delta) Phosphatidylinositol 4,5-bisphosphate 3-kinase catalytic subunit delta (PI3Kdelta) Phosphatidylinositol 4,5-bisphosphate 3-kinase catalytic subunit delta isoform (PI3K delta) Phosphatidylinositol 4,5-bisphosphate 3-kinase catalytic subunit delta isoform (PI3K-delta) Phosphatidylinositol 4,5-bisphosphate 3-kinase catalytic subunit delta isoform (PI3Kdelta)
Type:
Enzyme Subunit
Mol. Mass.:
119489.41
Organism:
Homo sapiens (Human)
Description:
O00329
Residue:
1044
  
Component 2
Name:
Phosphatidylinositol 4,5-bisphosphate 3-kinase catalytic subunit beta isoform
Synonyms:
PI3-kinase p110 subunit beta PI3Kbeta PIK3CB Phosphatidylinositol 4,5-bisphosphate 3-kinase catalytic subunit beta (PI3Kbeta) Phosphatidylinositol 4,5-bisphosphate 3-kinase catalytic subunit beta isoform (PI3K) Phosphatidylinositol 4,5-bisphosphate 3-kinase catalytic subunit beta isoform (PI3Kbeta) Phosphatidylinositol-4,5-bisphosphate 3-kinase catalytic subunit beta isoform Phosphoinositide 3-Kinase (PI3K), beta Chain A PtdIns-3-kinase p110
Type:
Enzyme Subunit
Mol. Mass.:
122769.00
Organism:
Homo sapiens (Human)
Description:
P42338
Residue:
1070
  
Inhibitor
Name:
BDBM255823
Synonyms:
3′-[1-(4-Amino-5-oxopyrido[2,3-d]pyrimidin-8(5H)-yl)ethyl]-5′-chloro-2′-methoxy-N,N,6′-trimethylbiphenyl-3-sulfonamide bis(trifluoroacetate) US10376513, Example 32 US11433071, Example 32 US9730939, Example 32
Type:
Small organic molecule
Emp. Form.:
C25H26ClN5O4S
Mol. Mass.:
528.023
SMILES:
COc1c(cc(Cl)c(C)c1-c1cccc(c1)S(=O)(=O)N(C)C)C(C)n1ccc(=O)c2c(N)ncnc12
: