Target
Phosphatidylinositol 4,5-bisphosphate 3-kinase catalytic subunit beta/delta isoform
Ligand
BDBM261075
Substrate
Meas. Tech.
A2 PI3Kdelta Scintillation Proximity Assay
pH
6.7±n/a
Temperature
298.15±n/a K
IC50
<10±n/a nM
Comments
extracted
Citation
 Li, YCombs, APYue, EWDouty, BMei, S Heterocyclylamines as PI3K inhibitors US Patent  US9707233 Publication Date 7/18/2017 
Target
Name:
Phosphatidylinositol 4,5-bisphosphate 3-kinase catalytic subunit beta/delta isoform
Synonyms:
p110δ/p85α p110-delta/ p110-gamma | pi3k$#948
Type:
Protein
Mol. Mass.:
Description:
Components:
This complex has 2 components.
Component 1
Name:
Phosphatidylinositol 4,5-bisphosphate 3-kinase catalytic subunit delta isoform
Synonyms:
PI3-kinase p110 subunit delta PI3-kinase subunit p110-delta PIK3CD Phosphatidylinositol 4,5-biphosphate 3-kinase catalytic subunit delta (PIK3CD) Phosphatidylinositol 4,5-bisphosphate 3-kinase 110 kDa catalytic subunit delta (PI3K delta) Phosphatidylinositol 4,5-bisphosphate 3-kinase catalytic subunit delta (PI3Kdelta) Phosphatidylinositol 4,5-bisphosphate 3-kinase catalytic subunit delta isoform (PI3K delta) Phosphatidylinositol 4,5-bisphosphate 3-kinase catalytic subunit delta isoform (PI3K-delta) Phosphatidylinositol 4,5-bisphosphate 3-kinase catalytic subunit delta isoform (PI3Kdelta)
Type:
Enzyme Subunit
Mol. Mass.:
119489.41
Organism:
Homo sapiens (Human)
Description:
O00329
Residue:
1044
  
Component 2
Name:
Phosphatidylinositol 4,5-bisphosphate 3-kinase catalytic subunit beta isoform
Synonyms:
PI3-kinase p110 subunit beta PI3Kbeta PIK3CB Phosphatidylinositol 4,5-bisphosphate 3-kinase catalytic subunit beta (PI3Kbeta) Phosphatidylinositol 4,5-bisphosphate 3-kinase catalytic subunit beta isoform (PI3K) Phosphatidylinositol 4,5-bisphosphate 3-kinase catalytic subunit beta isoform (PI3Kbeta) Phosphatidylinositol-4,5-bisphosphate 3-kinase catalytic subunit beta isoform Phosphoinositide 3-Kinase (PI3K), beta Chain A PtdIns-3-kinase p110
Type:
Enzyme Subunit
Mol. Mass.:
122769.00
Organism:
Homo sapiens (Human)
Description:
P42338
Residue:
1070
  
Inhibitor
Name:
BDBM261075
Synonyms:
1-(3-{3-[1-(4-Amino-3-methyl-1H- pyrazolo[3,4-d]pyrimidin-1- yl)ethyl]-5-chloro-2-ethoxy-6- methylphenyl}azetidin-1-yl)-2- methylpropan-2-ol3 US10376513, Example 98 US11433071, Example 98 US9730939, Example 98
Type:
Small organic molecule
Emp. Form.:
C24H33ClN6O2
Mol. Mass.:
473.011
SMILES:
CCOc1c(cc(Cl)c(C)c1C1CN(CC(C)(C)O)C1)C(C)n1nc(C)c2c(N)ncnc12
: