Target
Thymidine kinase
Ligand
BDBM21890
Substrate
BDBM21867
Meas. Tech.
Thymidine Kinase Inhibition Assay
pH
7.5±n/a
Temperature
310.15±n/a K
IC50
5700±n/a nM
Km
1000±n/a nM
Citation
 Manikowski, AVerri, ALossani, AGebhardt, BMGambino, JFocher, FSpadari, SWright, GE Inhibition of herpes simplex virus thymidine kinases by 2-phenylamino-6-oxopurines and related compounds: structure-activity relationships and antiherpetic activity in vivo. J Med Chem 48:3919-29 (2005)  
Target
Name:
Thymidine kinase
Synonyms:
TK
Type:
Transferase
Mol. Mass.:
40915.49
Organism:
Human herpesvirus 1
Description:
O72346
Residue:
376
  
Inhibitor
Name:
BDBM21890
Synonyms:
2,9-disubstituted 6-oxopurine, 12n | 9-[4-(3-hydroxypiperidin-1-yl)butyl]-2-(phenylamino)-6,9-dihydro-3H-purin-6-one dihydrochloride
Type:
Small organic molecule
Emp. Form.:
C20H26N6O2
Mol. Mass.:
382.4594
SMILES:
OC1CCCN(CCCCn2cnc3c2nc(Nc2ccccc2)[nH]c3=O)C1
:
Substrate
Name:
BDBM21867
Synonyms:
[3H-methyl]TdR | [3H]thymidine
Type:
radiolabeled ligand
Emp. Form.:
Mol. Mass.:
SMILES:
: