Target
Thymidine kinase
Ligand
BDBM21872
Substrate
BDBM21867
Meas. Tech.
Thymidine Kinase Inhibition Assay
IC50
2200±n/a nM
Citation
 Manikowski, AVerri, ALossani, AGebhardt, BMGambino, JFocher, FSpadari, SWright, GE Inhibition of herpes simplex virus thymidine kinases by 2-phenylamino-6-oxopurines and related compounds: structure-activity relationships and antiherpetic activity in vivo. J Med Chem 48:3919-29 (2005)  
Target
Name:
Thymidine kinase
Synonyms:
KITH_HHV23 | TK
Type:
Transferase
Mol. Mass.:
40467.78
Organism:
Human herpesvirus 2
Description:
Residue:
376
  
Inhibitor
Name:
BDBM21872
Synonyms:
2,9-disubstituted 6-oxopurine, 6 CHEMBL347128
Type:
Small organic molecule
Emp. Form.:
C13H13N5O2
Mol. Mass.:
271.2746
SMILES:
OCCn1cnc2c1nc(Nc1ccccc1)[nH]c2=O
:
Substrate
Name:
BDBM21867
Synonyms:
[3H-methyl]TdR | [3H]thymidine
Type:
radiolabeled ligand
Emp. Form.:
Mol. Mass.:
SMILES:
: