Target
Thymidine kinase
Ligand
BDBM21879
Substrate
BDBM21867
Meas. Tech.
Thymidine Kinase Inhibition Assay
IC50
380±n/a nM
Citation
 Manikowski, AVerri, ALossani, AGebhardt, BMGambino, JFocher, FSpadari, SWright, GE Inhibition of herpes simplex virus thymidine kinases by 2-phenylamino-6-oxopurines and related compounds: structure-activity relationships and antiherpetic activity in vivo. J Med Chem 48:3919-29 (2005)  
Target
Name:
Thymidine kinase
Synonyms:
KITH_HHV23 | TK
Type:
Transferase
Mol. Mass.:
40467.78
Organism:
Human herpesvirus 2
Description:
Residue:
376
  
Inhibitor
Name:
BDBM21879
Synonyms:
2,9-disubstituted 6-oxopurine, 12c | 9-{4-[ethyl(methyl)amino]butyl}-2-(phenylamino)-6,9-dihydro-3H-purin-6-one dihydrochloride
Type:
Small organic molecule
Emp. Form.:
C18H24N6O
Mol. Mass.:
340.4228
SMILES:
CCN(C)CCCCn1cnc2c1nc(Nc1ccccc1)[nH]c2=O
:
Substrate
Name:
BDBM21867
Synonyms:
[3H-methyl]TdR | [3H]thymidine
Type:
radiolabeled ligand
Emp. Form.:
Mol. Mass.:
SMILES:
: