Target
Adenosine deaminase
Ligand
BDBM21956
Substrate
BDBM14487
Meas. Tech.
ADA Inhibition Assay
pH
7±n/a
Temperature
298.15±n/a K
Ki
51440±3260 nM
Citation
 Ujjinamatada, RKPhatak, PBurger, AMHosmane, RS Inhibition of adenosine deaminase by analogues of adenosine and inosine, incorporating a common heterocyclic base, 4(7)-amino-6(5)H-imidazo[4,5-d]pyridazin-7(4)one. J Med Chem 51:694-8 (2008)  
Target
Name:
Adenosine deaminase
Synonyms:
ADA Adenosine aminohydrolase
Type:
Enzyme
Mol. Mass.:
40910.44
Organism:
Bos taurus (bovine)
Description:
Residue:
363
  
Inhibitor
Name:
BDBM21956
Synonyms:
7-amino-1-[(2R,3R,4S,5R)-3,4-dihydroxy-5-(hydroxymethyl)oxolan-2-yl]-1H,4H,5H-imidazo[4,5-d]pyridazin-4-one | Nucleoside analogue, 4
Type:
Emp. Form.:
C10H13N5O5
Mol. Mass.:
283.2407
SMILES:
Nc1n[nH]c(=O)c2ncn([C@@H]3O[C@H](CO)[C@@H](O)[C@H]3O)c12
:
Substrate
Name:
BDBM14487
Synonyms:
(2R,3R,4S,5R)-2-(6-amino-9H-purin-9-yl)-5-(hydroxymethyl)oxolane-3,4-diol Adenosine N6-Methylado cid_191 | cid_60961
Type:
Nucleoside or nucleotide
Emp. Form.:
C10H13N5O4
Mol. Mass.:
267.2413
SMILES:
Nc1ncnc2n(cnc12)[C@@H]1O[C@H](CO)[C@@H](O)[C@H]1O
: