Target
Nitric oxide synthase, brain
Ligand
BDBM21971
Substrate
BDBM21959
Meas. Tech.
NOS Enzyme Inhibition Assay
pH
7.4±n/a
Temperature
303.15±n/a K
Ki
290±n/a nM
IC50
2400±n/a nM
Km
1300±n/a nM
Citation
 Erdal, EPMartásek, PRoman, LJSilverman, RB Hydroxyethylene isosteres of selective neuronal nitric oxide synthase inhibitors. Bioorg Med Chem 15:6096-108 (2007)  
Target
Name:
Nitric oxide synthase, brain
Synonyms:
Bnos NC-NOS NOS type I nNOS Neuronal nitric oxide synthase Nitric Oxide Synthase, brain Nitric oxide synthase, brain (nNOS) Nitric-oxide synthase, brain (nNOS) Nos1 | Peptidyl-cysteine S-nitrosylase NOS1
Type:
Enzyme
Mol. Mass.:
160570.98
Organism:
Rattus norvegicus (rat)
Description:
Recombinant nNOS overexpressed in E. coli was used in enzyme assays.
Residue:
1429
  
Inhibitor
Name:
BDBM21971
Synonyms:
3-[(4S,6S)-4,8-diamino-6-hydroxyoctyl]-1-nitroguanidine | Hydroxyethylene derivative, 10
Type:
Emp. Form.:
C9H22N6O3
Mol. Mass.:
262.3094
SMILES:
NCC[C@H](O)C[C@@H](N)CCCN=C(N)N[N+]([O-])=O
:
Substrate
Name:
BDBM21959
Synonyms:
(2S)-2-amino-5-carbamimidamidopentanoic acid CHEMBL1485 | L-arginine
Type:
Amino Acid
Emp. Form.:
C6H14N4O2
Mol. Mass.:
174.201
SMILES:
[#7]-[#6@@H](-[#6]-[#6]-[#6]\[#7]=[#6](/[#7])-[#7])-[#6](-[#8])=O
: