Target
Nuclear receptor ROR-gamma
Ligand
BDBM261376
Substrate
Meas. Tech.
ROR gamma SPA Binding Assay
Temperature
298.15±n/a K
IC50
2458±n/a nM
Comments
extracted
Citation
 Duan, JDhar, TGJiang, BKarmakar, AGupta, AKLu, ZWeigelt, CA Cyclohexyl sulfone RORγ modulators US Patent  US9708253 Publication Date 7/18/2017 
Target
Name:
Nuclear receptor ROR-gamma
Synonyms:
NR1F3 Nuclear receptor ROR-gamma (RORC) RAR-related orphan receptor C (RORc) RORG RZRG Retinoid-related orphan receptor-gamma (RORc)
Type:
Enzyme Catalytic Domain
Mol. Mass.:
58218.40
Organism:
Homo sapiens (Human)
Description:
P51449
Residue:
518
  
Inhibitor
Name:
BDBM261376
Synonyms:
US9708253, 34 | US9708253, 35
Type:
Small organic molecule
Emp. Form.:
C34H32F9NO5S
Mol. Mass.:
737.672
SMILES:
Fc1ccc(cc1)S(=O)(=O)[C@@]1(CC[C@@H](CC1)NC(=O)C1CCOCC1)c1ccc(cc1)C(OCc1c(F)cccc1F)(C(F)(F)F)C(F)(F)F
: