Target
Nuclear receptor ROR-gamma
Ligand
BDBM261433
Substrate
Meas. Tech.
ROR gamma SPA Binding Assay
Temperature
298.15±n/a K
IC50
124±n/a nM
Comments
extracted
Citation
 Duan, JDhar, TGJiang, BKarmakar, AGupta, AKLu, ZWeigelt, CA Cyclohexyl sulfone RORγ modulators US Patent  US9708253 Publication Date 7/18/2017 
Target
Name:
Nuclear receptor ROR-gamma
Synonyms:
NR1F3 Nuclear receptor ROR-gamma (RORC) RAR-related orphan receptor C (RORc) RORG RZRG Retinoid-related orphan receptor-gamma (RORc)
Type:
Enzyme Catalytic Domain
Mol. Mass.:
58218.40
Organism:
Homo sapiens (Human)
Description:
P51449
Residue:
518
  
Inhibitor
Name:
BDBM261433
Synonyms:
4-((4-fluorophenyl)sulfonyl)-4-(4-(1,1,1,3,3,3-hexafluoro-2-hydroxypropan-2-yl)phenyl)cyclohexanecarboxylic acid, Diastereomer 1 | US9708253, 92
Type:
Small organic molecule
Emp. Form.:
C29H24F7NO3S
Mol. Mass.:
599.56
SMILES:
Fc1ccc(cc1)S(=O)(=O)C1(CCC(CC1)C#N)c1ccc(cc1)C(OCc1ccccc1)(C(F)(F)F)C(F)(F)F
: