Target
Nuclear receptor ROR-gamma
Ligand
BDBM261435
Substrate
Meas. Tech.
ROR gamma SPA Binding Assay
Temperature
298.15±n/a K
IC50
397±n/a nM
Comments
extracted
Citation
 Duan, JDhar, TGJiang, BKarmakar, AGupta, AKLu, ZWeigelt, CA Cyclohexyl sulfone RORγ modulators US Patent  US9708253 Publication Date 7/18/2017 
Target
Name:
Nuclear receptor ROR-gamma
Synonyms:
NR1F3 Nuclear receptor ROR-gamma (RORC) RAR-related orphan receptor C (RORc) RORG RZRG Retinoid-related orphan receptor-gamma (RORc)
Type:
Enzyme Catalytic Domain
Mol. Mass.:
58218.40
Organism:
Homo sapiens (Human)
Description:
P51449
Residue:
518
  
Inhibitor
Name:
BDBM261435
Synonyms:
N-(4-((4-fluorophenyl)sulfonyl)-4-(4-(1,1,1,3,3,3-hexafluoro-2-hydroxypropan-2-yl)phenyl)-1-methylcyclohexyl)nicotinamide | US9708253, 94
Type:
Small organic molecule
Emp. Form.:
C32H32F7NO4S2
Mol. Mass.:
691.72
SMILES:
[#6]C([#6])([#6])[S@](=O)\[#7]=[#6]-1/[#6]-[#6]C([#6]-[#6]-1)(c1ccc(cc1)C([#8]-[#6]-c1ccccc1)(C(F)(F)F)C(F)(F)F)S(=O)(=O)c1ccc(F)cc1
: