Target
Nuclear receptor ROR-gamma
Ligand
BDBM261437
Substrate
Meas. Tech.
ROR gamma SPA Binding Assay
Temperature
298.15±n/a K
IC50
549±n/a nM
Comments
extracted
Citation
 Duan, JDhar, TGJiang, BKarmakar, AGupta, AKLu, ZWeigelt, CA Cyclohexyl sulfone RORγ modulators US Patent  US9708253 Publication Date 7/18/2017 
Target
Name:
Nuclear receptor ROR-gamma
Synonyms:
NR1F3 Nuclear receptor ROR-gamma (RORC) RAR-related orphan receptor C (RORc) RORG RZRG Retinoid-related orphan receptor-gamma (RORc)
Type:
Enzyme Catalytic Domain
Mol. Mass.:
58218.40
Organism:
Homo sapiens (Human)
Description:
P51449
Residue:
518
  
Inhibitor
Name:
BDBM261437
Synonyms:
2-((1s,4s)-4-((4-fluorophenyl)sulfonyl)-4-(4-(perfluoropropan-2-yl)phenyl)cyclohexyl)-1H-pyrrolo[3,4-c]pyridine-1,3(2H)-dione | US9708253, 96
Type:
Small organic molecule
Emp. Form.:
C28H20F8N2O4S
Mol. Mass.:
632.522
SMILES:
Fc1ccc(cc1)S(=O)(=O)[C@@]1(CC[C@@H](CC1)N1C(=O)c2ccncc2C1=O)c1ccc(cc1)C(F)(C(F)(F)F)C(F)(F)F
: