Target
Nuclear receptor ROR-gamma
Ligand
BDBM261443
Substrate
Meas. Tech.
ROR gamma SPA Binding Assay
Temperature
298.15±n/a K
IC50
1443±n/a nM
Comments
extracted
Citation
 Duan, JDhar, TGJiang, BKarmakar, AGupta, AKLu, ZWeigelt, CA Cyclohexyl sulfone RORγ modulators US Patent  US9708253 Publication Date 7/18/2017 
Target
Name:
Nuclear receptor ROR-gamma
Synonyms:
NR1F3 Nuclear receptor ROR-gamma (RORC) RAR-related orphan receptor C (RORc) RORG RZRG Retinoid-related orphan receptor-gamma (RORc)
Type:
Enzyme Catalytic Domain
Mol. Mass.:
58218.40
Organism:
Homo sapiens (Human)
Description:
P51449
Residue:
518
  
Inhibitor
Name:
BDBM261443
Synonyms:
US9708253, 102 | US9708253, 108
Type:
Small organic molecule
Emp. Form.:
C28H24F8N2O3S
Mol. Mass.:
620.554
SMILES:
Fc1ccc(cc1)S(=O)(=O)C1(CCC(CC1)C(=O)NCc1ccncc1)c1ccc(cc1)C(F)(C(F)(F)F)C(F)(F)F
: