Target
Nuclear receptor ROR-gamma
Ligand
BDBM261460
Substrate
Meas. Tech.
ROR gamma SPA Binding Assay
Temperature
298.15±n/a K
IC50
141±n/a nM
Comments
extracted
Citation
 Duan, JDhar, TGJiang, BKarmakar, AGupta, AKLu, ZWeigelt, CA Cyclohexyl sulfone RORγ modulators US Patent  US9708253 Publication Date 7/18/2017 
Target
Name:
Nuclear receptor ROR-gamma
Synonyms:
NR1F3 Nuclear receptor ROR-gamma (RORC) RAR-related orphan receptor C (RORc) RORG RZRG Retinoid-related orphan receptor-gamma (RORc)
Type:
Enzyme Catalytic Domain
Mol. Mass.:
58218.40
Organism:
Homo sapiens (Human)
Description:
P51449
Residue:
518
  
Inhibitor
Name:
BDBM261460
Synonyms:
(1-((1s,4s)-4-(4-fluorophenylsulfonyl)-4-(4-(perfluoropropan-2-yl)phenyl)cyclohexyl)-1 H-1,2,3-triazol-4-yl)(morpholino)methanone | US9708253, 119
Type:
Small organic molecule
Emp. Form.:
C28H26F8N4O4S
Mol. Mass.:
666.583
SMILES:
Fc1ccc(cc1)S(=O)(=O)[C@@]1(CC[C@@H](CC1)n1cc(nn1)C(=O)N1CCOCC1)c1ccc(cc1)C(F)(C(F)(F)F)C(F)(F)F
: