Target
Nuclear receptor ROR-gamma
Ligand
BDBM261464
Substrate
Meas. Tech.
ROR gamma SPA Binding Assay
Temperature
298.15±n/a K
IC50
145±n/a nM
Comments
extracted
Citation
 Duan, JDhar, TGJiang, BKarmakar, AGupta, AKLu, ZWeigelt, CA Cyclohexyl sulfone RORγ modulators US Patent  US9708253 Publication Date 7/18/2017 
Target
Name:
Nuclear receptor ROR-gamma
Synonyms:
NR1F3 Nuclear receptor ROR-gamma (RORC) RAR-related orphan receptor C (RORc) RORG RZRG Retinoid-related orphan receptor-gamma (RORc)
Type:
Enzyme Catalytic Domain
Mol. Mass.:
58218.40
Organism:
Homo sapiens (Human)
Description:
P51449
Residue:
518
  
Inhibitor
Name:
BDBM261464
Synonyms:
N-((2R,4R)-4-(4-fluorophenylsulfonyl)-2-methyl-4-(4-(perfluoropropan-2-yl)phenyl)cyclohexyl)-2-(pyridin-4-yl)acetamide | US9708253, 123
Type:
Small organic molecule
Emp. Form.:
C29H26F8N2O3S
Mol. Mass.:
634.581
SMILES:
C[C@@H]1C[C@](CCC1NC(=O)Cc1ccncc1)(c1ccc(cc1)C(F)(C(F)(F)F)C(F)(F)F)S(=O)(=O)c1ccc(F)cc1
: