Target
Nitric oxide synthase, brain
Ligand
BDBM21961
Substrate
BDBM21959
Meas. Tech.
NOS Enzyme Inhibition Assay
pH
7.5±n/a
Temperature
303.15±n/a K
Ki
100±n/a nM
Citation
 Flinspach, MLLi, HJamal, JYang, WHuang, HHah, JMGiómez-Vidal, JALitzinger, EASilverman, RBPoulos, TL Structural basis for dipeptide amide isoform-selective inhibition of neuronal nitric oxide synthase. Nat Struct Mol Biol 11:54-9 (2004)  
Target
Name:
Nitric oxide synthase, brain
Synonyms:
Bnos NC-NOS NOS type I nNOS Neuronal nitric oxide synthase Nitric Oxide Synthase, brain Nitric oxide synthase, brain (nNOS) Nitric-oxide synthase, brain (nNOS) Nos1 | Peptidyl-cysteine S-nitrosylase NOS1
Type:
Enzyme
Mol. Mass.:
160570.98
Organism:
Rattus norvegicus (rat)
Description:
Recombinant nNOS overexpressed in E. coli was used in enzyme assays.
Residue:
1429
  
Inhibitor
Name:
BDBM21961
Synonyms:
(2S,4R)-4-[(2S)-2-amino-5-(1-nitrocarbamimidamido)pentanamido]pyrrolidine-2-carboxamide JMC522060 Compound 3 | N omega-Nitro-L-Arginine-Containing Dipeptide, 2
Type:
Emp. Form.:
C11H22N8O4
Mol. Mass.:
330.3436
SMILES:
N[C@@H](CCCN=C(N)N[N+]([O-])=O)C(=O)N[C@H]1CN[C@@H](C1)C(N)=O
:
Substrate
Name:
BDBM21959
Synonyms:
(2S)-2-amino-5-carbamimidamidopentanoic acid CHEMBL1485 | L-arginine
Type:
Amino Acid
Emp. Form.:
C6H14N4O2
Mol. Mass.:
174.201
SMILES:
[#7]-[#6@@H](-[#6]-[#6]-[#6]\[#7]=[#6](/[#7])-[#7])-[#6](-[#8])=O
: