Target
Cathepsin B-like cysteine protease
Ligand
BDBM22053
Substrate
BDBM22047
Meas. Tech.
Enzyme Inhibition Assay
pH
5.5±n/a
Temperature
295.15±n/a K
IC50
>25000±n/a nM
Citation
 Mallari, JPShelat, AAObrien, TCaffrey, CRKosinski, AConnelly, MHarbut, MGreenbaum, DMcKerrow, JHGuy, RK Development of potent purine-derived nitrile inhibitors of the trypanosomal protease TbcatB. J Med Chem 51:545-52 (2008)  
Target
Name:
Cathepsin B-like cysteine protease
Synonyms:
CPC Cysteine peptidase C | TbcatB
Type:
Enzyme
Mol. Mass.:
37220.37
Organism:
Trypanosoma brucei
Description:
Enzyme was expressed in yeast Pichia pastoris.
Residue:
340
  
Inhibitor
Name:
BDBM22053
Synonyms:
9-cyclopentyl-6-(hexylamino)-9H-purine-2-carbonitrile | Compound 3{3,13}
Type:
Small organic molecule
Emp. Form.:
C17H24N6
Mol. Mass.:
312.4127
SMILES:
CCCCCCNc1nc(nc2n(cnc12)C1CCCC1)C#N
:
Substrate
Name:
BDBM22047
Synonyms:
CBZ-Phe-Arg 7-amido-4-methylcoumarin | Z-Phe-Arg-AMC
Type:
Fluorogenic substrate
Emp. Form.:
C33H36N6O6
Mol. Mass.:
612.6755
SMILES:
[#6]-c1cc(=O)oc2cc(-[#7]-[#6](=O)-[#6](-[#6]-[#6]-[#6]\[#7]=[#6](\[#7])-[#7])-[#7]-[#6](=O)-[#6](-[#6]-c3ccccc3)-[#7]-[#6](=O)-[#8]-[#6]-c3ccccc3)ccc12
: