Target
Sodium channel protein type 9 subunit alpha
Ligand
BDBM371637
Substrate
Meas. Tech.
Rubidium efflux assay
IC50
5.00±n/a nM
Citation
 Ramdas, VLoriya, RMBanerjee, MPatil, PRJoshi, AADatrange, LSWalke, DSKhan, THDas, AKGote, GNKalhapure, VMPalle, VPKamboj, RK Sulfonamide compounds as voltage-gated sodium channel modulators US Patent  US10239869 Publication Date 3/26/2019 
Target
Name:
Sodium channel protein type 9 subunit alpha
Synonyms:
NENA Peripheral sodium channel 1 SCN9A_HUMAN Voltage-gated sodium channel subunit Nav1.7 hNE-Na
Type:
Protein
Mol. Mass.:
226375.97
Organism:
Homo sapiens (Human)
Description:
Q15858
Residue:
1988
  
Inhibitor
Name:
BDBM371637
Synonyms:
(R)-N-(6-Fluoropyridin-2-yl)-4-(2-(2-methylthiazol-4-yl)-4-(trifluoromethyl)phenylchroman-7-sulfonamide | US10239869, Example 62
Type:
Small organic molecule
Emp. Form.:
C25H19F4N3O3S2
Mol. Mass.:
549.56
SMILES:
Cc1nc(cs1)-c1cc(ccc1[C@H]1CCOc2cc(ccc12)S(=O)(=O)Nc1cccc(F)n1)C(F)(F)F
: