Target
Sodium channel protein type 9 subunit alpha
Ligand
BDBM371757
Substrate
Meas. Tech.
Rubidium efflux assay
IC50
11.0±n/a nM
Citation
 Ramdas, VLoriya, RMBanerjee, MPatil, PRJoshi, AADatrange, LSWalke, DSKhan, THDas, AKGote, GNKalhapure, VMPalle, VPKamboj, RK Sulfonamide compounds as voltage-gated sodium channel modulators US Patent  US10239869 Publication Date 3/26/2019 
Target
Name:
Sodium channel protein type 9 subunit alpha
Synonyms:
NENA Peripheral sodium channel 1 SCN9A_HUMAN Voltage-gated sodium channel subunit Nav1.7 hNE-Na
Type:
Protein
Mol. Mass.:
226375.97
Organism:
Homo sapiens (Human)
Description:
Q15858
Residue:
1988
  
Inhibitor
Name:
BDBM371757
Synonyms:
N-(pyrimidin-4-yl)-4-(2-(((S)-tetrahydrofuran-3-yl)oxy)-4-(trifluoromethyl)phenyl)chroman-7-sulfonamide | US10239869, Example 183
Type:
Small organic molecule
Emp. Form.:
C24H22F3N3O5S
Mol. Mass.:
521.509
SMILES:
FC(F)(F)c1ccc([C@H]2CCOc3cc(ccc23)S(=O)(=O)Nc2ccncn2)c(O[C@H]2CCOC2)c1
: