Target
Legumain
Ligand
BDBM22142
Substrate
BDBM22115
Meas. Tech.
AE Enzyme Inhibition Assay
Temperature
298.15±n/a K
IC50
300±n/a nM
Comments
extracted
Citation
 Götz, MGJames, KEHansell, EDvorák, JSeshaadri, ASojka, DKopácek, PMcKerrow, JHCaffrey, CRPowers, JC Aza-peptidyl Michael Acceptors. A New Class of Potent and Selective Inhibitors of Asparaginyl Endopeptidases (Legumains) from Evolutionarily Diverse Pathogens. J Med Chem 51:2816-32 (2008)  
Target
Name:
Legumain
Synonyms:
Asparaginyl Endopeptidase (AE)
Type:
Enzyme
Mol. Mass.:
49047.79
Organism:
Schistosoma mansoni
Description:
Q9NFY9
Residue:
429
  
Inhibitor
Name:
BDBM22142
Synonyms:
aza-peptide Michael acceptor, 5v | benzyl N-[(1S)-1-{[(1S)-1-[N'-(carbamoylmethyl)-N'-[(2E)-4-(2,3-dihydro-1H-isoindol-2-yl)-4-oxobut-2-enoyl]hydrazinecarbonyl]ethyl]carbamoyl}ethyl]carbamate
Type:
Small organic molecule
Emp. Form.:
C28H32N6O7
Mol. Mass.:
564.5897
SMILES:
C[C@H](NC(=O)OCc1ccccc1)C(=O)N[C@@H](C)C(=O)NN(CC(N)=O)C(=O)C=CC(=O)N1Cc2ccccc2C1
:
Substrate
Name:
BDBM22115
Synonyms:
Cbz-Ala-Ala-Asn-AMC
Type:
Fluorogenic substrate
Emp. Form.:
Mol. Mass.:
SMILES:
: