Target
D(2) dopamine receptor
Ligand
BDBM372039
Substrate
Meas. Tech.
Functional Calcium Assay
Ki
5.50±n/a nM
Citation
 Cremonesi, SMicheli, FSemerano, TTarsi, L Dopamine D3 receptor antagonists US Patent  US10239870 Publication Date 3/26/2019 
Target
Name:
D(2) dopamine receptor
Synonyms:
D(2) dopamine receptor DOPAMINE D2 Long DRD2 Dopamine D2 receptor Dopamine D2 receptor (D2R) Dopamine2-like | d2
Type:
Cell-surface receptors
Mol. Mass.:
50647.10
Organism:
Homo sapiens (Human)
Description:
P14416
Residue:
443
  
Inhibitor
Name:
BDBM372039
Synonyms:
US10239870, Example 312
Type:
Small organic molecule
Emp. Form.:
C24H28F3N5OS
Mol. Mass.:
491.572
SMILES:
Cc1ncoc1-c1nnc(SCCCN2CCC[C@]3(C[C@H]3c3ccc(cc3)C(F)(F)F)C2)n1C
: