Target
Substance-P receptor
Ligand
BDBM261486
Substrate
Meas. Tech.
Receptor Binding Assay
pH
7.4±n/a
Temperature
298.15±n/a K
IC50
2.35±n/a nM
Comments
extracted
Citation
 Shimizu, KOhno, KMiyagi, TUeno, YSuzuki, H Cyclohexyl pyridine derivative US Patent  US9708266 Publication Date 7/18/2017 
Target
Name:
Substance-P receptor
Synonyms:
NK-1 receptor NK1 Receptor NK1R_HUMAN Neurokinin-1 (NK-1) SPR TACR1 Tachykinin receptor 1 (NK1) | tachykinin
Type:
G Protein-Coupled Receptor (GPCR)
Mol. Mass.:
46254.43
Organism:
Homo sapiens (Human)
Description:
P25103
Residue:
407
  
Inhibitor
Name:
BDBM261486
Synonyms:
US10011568, Ex. No. 9 | US9708266, 9
Type:
Small organic molecule
Emp. Form.:
C33H34F6N2O3
Mol. Mass.:
620.6251
SMILES:
CN(C(=O)C(C)(C)c1cc(cc(c1)C(F)(F)F)C(F)(F)F)c1cnc(cc1-c1ccccc1C)C1CCC(CC(O)=O)CC1
: