Target
Cytochrome P450 3A4
Ligand
BDBM261488
Substrate
Meas. Tech.
CYP3A4 Inhibition Assay
pH
7.4±n/a
Temperature
298.15±n/a K
IC50
2700±n/a nM
Comments
extracted
Citation
 Shimizu, KOhno, KMiyagi, TUeno, YSuzuki, H Cyclohexyl pyridine derivative US Patent  US9708266 Publication Date 7/18/2017 
Target
Name:
Cytochrome P450 3A4
Synonyms:
Albendazole monooxygenase CP3A4_HUMAN CYP3A4 CYPIIIA4 Cytochrome P450 3A4 (CYP3A4) Nifedipine oxidase Taurochenodeoxycholate 6-alpha-hydroxylase
Type:
Enzyme
Mol. Mass.:
57349.57
Organism:
Homo sapiens (Human)
Description:
Residue:
503
  
Inhibitor
Name:
BDBM261488
Synonyms:
US10011568, Ex. No. 11 | US9708266, 11
Type:
Small organic molecule
Emp. Form.:
C35H37F7N2O3
Mol. Mass.:
666.6687
SMILES:
CN(C(=O)C(C)(C)c1cc(cc(c1)C(F)(F)F)C(F)(F)F)c1cnc(cc1-c1ccc(F)cc1C)[C@H]1CC[C@@H](CC1)C(C)(C)C(O)=O
: