Target
D(1A) dopamine receptor
Ligand
BDBM372047
Substrate
Meas. Tech.
In Vitro Binding Assay for DDR1
IC50
359±n/a nM
Citation
 Buettelmann, BKocer, BKuhn, BPrunotto, MRichter, HRitter, MRudolph, MSatz, AL Triaza-spirodecanones as DDR1 inhibitors US Patent  US10239876 Publication Date 3/26/2019 
Target
Name:
D(1A) dopamine receptor
Synonyms:
DA D1 receptor DRD1 Dopamine D1 receptor Dopamine D1A
Type:
Enzyme
Mol. Mass.:
49303.43
Organism:
Homo sapiens (Human)
Description:
P21728
Residue:
446
  
Inhibitor
Name:
BDBM372047
Synonyms:
(RS)-3-[2-(3-Hydroxy-3-methylpyrrolidin-1-yl)-2-oxoethyl]-1-phenyl-8-(1H-pyrazolo[3,4-b]pyridine-5-carbonyl)-1,3,8-triazaspiro[4.5]decan-4-one US10435407, Example 70
Type:
Small organic molecule
Emp. Form.:
C27H31N7O4
Mol. Mass.:
517.5795
SMILES:
CC1(O)CCN(C1)C(=O)CN1CN(c2ccccc2)C2(CCN(CC2)C(=O)c2cnc3[nH]ncc3c2)C1=O
: