Target
D(1A) dopamine receptor
Ligand
BDBM372080
Substrate
Meas. Tech.
In Vitro Binding Assay for DDR1
IC50
25.0±n/a nM
Citation
 Buettelmann, BKocer, BKuhn, BPrunotto, MRichter, HRitter, MRudolph, MSatz, AL Triaza-spirodecanones as DDR1 inhibitors US Patent  US10239876 Publication Date 3/26/2019 
Target
Name:
D(1A) dopamine receptor
Synonyms:
DA D1 receptor DRD1 Dopamine D1 receptor Dopamine D1A
Type:
Enzyme
Mol. Mass.:
49303.43
Organism:
Homo sapiens (Human)
Description:
P21728
Residue:
446
  
Inhibitor
Name:
BDBM372080
Synonyms:
2-(8-(3-Methyl-1H-indazole-5-carbonyl)-4-oxo-1-phenyl-1,3,8-triazaspiro[4.5]decan-3-yl)-N-(2,2,2-trifluoroethyl)acetamide US10435407, Example 103
Type:
Small organic molecule
Emp. Form.:
C26H27F3N6O3
Mol. Mass.:
528.5262
SMILES:
Cc1n[nH]c2ccc(cc12)C(=O)N1CCC2(CC1)N(CN(CC(=O)NCC(F)(F)F)C2=O)c1ccccc1
: